# suite on h8-boot42  hibernate=8.0.0.Beta3 persistence-api=4.0.0-M7
spring boot parent: 4.2.0-M2
pins (hibernate-models 1.3.4, jandex 3.6.0): yes
test-compile exit code: 0
tests run: 205  failures: 1  errors: 158  skipped: 0
test classes with a problem: 52
distinct final causes (count = failing test methods):
   140  (context failed earlier in the same JVM; see the first failure of that context)
    14  java.lang.NoSuchMethodException: org.springframework.orm.jpa.persistenceunit.SpringPersistenceUnitInfo.getAllPackageDescriptors()
     4  org.hibernate.query.NamedQueryValidationException: Errors in named queries: 
     1  java.lang.AssertionError: 
